Reaction Details
TargetCannabinoid receptor 1
LigandBDBM50161564
Substrate/Competitorn/a
Meas. Tech.ChEMBL_500314 (CHEMBL973406)
IC50 19054.61±n/a nM
Citation Kang, NSLee, GNYoo, SE Predictive models of Cannabinoid-1 receptor antagonists derived from diverse classes. Bioorg Med Chem Lett19:2990-6 (2009) 
 
Cannabinoid receptor 1
Name:Cannabinoid receptor 1
Type:G Protein-Coupled Receptor (GPCR)
Mol. Mass.:52868.96
Organism:Homo sapiens (Human)
Description:P21554
Residue:472
BDBM50161564
NameBDBM50161564
Synonyms:(1-Methyl-4,5-diphenyl-1H-imidazol-2-yl)-piperidin-1-yl-methanone CHEMBL362638
TypeSmall organic molecule
Emp. Form.C22H23N3O
Mol. Mass.345.4375
SMILESCn1c(nc(c1-c1ccccc1)-c1ccccc1)C(=O)N1CCCCC1