Reaction Details
TargetCannabinoid receptor 1
LigandBDBM35873
Substrate/Competitorn/a
Meas. Tech.ChEMBL_500314 (CHEMBL973406)
IC50 8.13±n/a nM
Citation Kang, NSLee, GNYoo, SE Predictive models of Cannabinoid-1 receptor antagonists derived from diverse classes. Bioorg Med Chem Lett19:2990-6 (2009) 
 
Cannabinoid receptor 1
Name:Cannabinoid receptor 1
Type:G Protein-Coupled Receptor (GPCR)
Mol. Mass.:52868.96
Organism:Homo sapiens (Human)
Description:P21554
Residue:472
BDBM35873
NameBDBM35873
Synonyms:5,6-bis(4-chlorophenyl)-N-(piperidin-1-yl)pyrazine-2-carboxamide 5,6-diaryl-pyrazine-2-amide derivative, 5e | CHEMBL390146
TypeSmall organic molecule
Emp. Form.C22H20Cl2N4O
Mol. Mass.427.326
SMILESClc1ccc(cc1)-c1ncc(nc1-c1ccc(Cl)cc1)C(=O)NN1CCCCC1