Reaction Details
TargetCannabinoid receptor 1
LigandBDBM50161561
Substrate/Competitorn/a
Meas. Tech.ChEMBL_500314 (CHEMBL973406)
IC50 6025.6±n/a nM
Citation Kang, NSLee, GNYoo, SE Predictive models of Cannabinoid-1 receptor antagonists derived from diverse classes. Bioorg Med Chem Lett19:2990-6 (2009) 
 
Cannabinoid receptor 1
Name:Cannabinoid receptor 1
Type:G Protein-Coupled Receptor (GPCR)
Mol. Mass.:52868.96
Organism:Homo sapiens (Human)
Description:P21554
Residue:472
BDBM50161561
NameBDBM50161561
Synonyms:4,5-Bis-(4-chloro-phenyl)-1H-imidazole-2-carboxylic acid piperidin-1-ylamide CHEMBL361181
TypeSmall organic molecule
Emp. Form.C21H20Cl2N4O
Mol. Mass.415.316
SMILESClc1ccc(cc1)-c1nc([nH]c1-c1ccc(Cl)cc1)C(=O)NN1CCCCC1