Reaction Details
TargetKappa-type opioid receptor
LigandBDBM50010702
Substrate/Competitorn/a
Meas. Tech.ChEMBL_523553 (CHEMBL1001567)
EC50 6.3±n/a nM
Citation Guerrini, RCamarda, VTrapella, CCaló, GRizzi, ARuzza, CFiorini, SMarzola, EReinscheid, RKRegoli, DSalvadori, S Further studies at neuropeptide s position 5: discovery of novel neuropeptide S receptor antagonists. J Med Chem52:4068-71 (2009) 
 
Kappa-type opioid receptor
Name:Kappa-type opioid receptor
Type:G Protein-Coupled Receptor (GPCR)
Mol. Mass.:42648.76
Organism:Homo sapiens (Human)
Description:P41145
Residue:380
BDBM50010702
NameBDBM50010702
Synonyms:CHEMBL411557 Dynorphin A (1-17) Tyr-Gly-Gly-Phe-Leu-Arg-Arg-Ile-Arg-Pro-Lys-Leu-Lys-Trp-Asp-Asn-Gln | dynorphin A
TypeSmall organic molecule
Emp. Form.C99H155N31O23
Mol. Mass.2147.4839
SMILESCC[C@H](C)[C@H](NC(=O)[C@H](CCCN=C(N)N)NC(=O)[C@H](CCCNC(N)=N)NC(=O)[C@H](CC(C)C)NC(=O)[C@H](Cc1ccccc1)NC(=O)CNC(=O)CNC(=O)[C@@H](N)Cc1ccc(O)cc1)C(=O)N[C@@H](CCCN=C(N)N)C(=O)N1CCC[C@H]1C(=O)N[C@@H](CCCCN)C(=O)N[C@@H](CC(C)C)C(=O)N[C@@H](CCCCN)C(=O)N[C@@H](Cc1c[nH]c2ccccc12)C(=O)N[C@@H](CC(O)=O)C(=O)N[C@@H](CC(N)=O)C(=O)N[C@@H](CCC(N)=O)C(O)=O