Reaction Details
TargetAdenosine receptor A3
LigandBDBM50413806
Substrate/Competitorn/a
Meas. Tech.ChEMBL_522126 (CHEMBL1006578)
Ki 2.95±n/a nM
Citation Sharma, SSharma, BKSharma, SKSingh, PPrabhakar, YS Topological descriptors in modeling the agonistic activity of human A3 adenosine receptor ligands: the derivatives of 2-chloro-N(6)-substituted-4'-thioadenosine-5'-uronamide. Eur J Med Chem44:1377-82 (2009) 
 
Adenosine receptor A3
Name:Adenosine receptor A3
Type:G Protein-Coupled Receptor (GPCR)
Mol. Mass.:36197.32
Organism:Homo sapiens (Human)
Description:P0DMS8
Residue:318
BDBM50413806
NameBDBM50413806
Synonyms:CHEMBL486374
TypeSmall organic molecule
Emp. Form.C20H20ClIN6O4
Mol. Mass.570.768
SMILESOC1C(O)C(OC1C(=O)NC1CC1)n1cnc2c(NCc3cccc(I)c3)nc(Cl)nc12