Reaction Details
TargetSodium channel protein type 4 subunit alpha
LigandBDBM50291990
Substrate/Competitorn/a
Meas. Tech.ChEMBL_521570 (CHEMBL1004181)
EC50 275422.87±n/a nM
Citation Carrieri, AMuraglia, MCorbo, FPacifico, C 2D- and 3D-QSAR of tocainide and mexiletine analogues acting as Na(v)1.4 channel blockers. Eur J Med Chem44:1477-85 (2009) 
 
Sodium channel protein type 4 subunit alpha
Name:Sodium channel protein type 4 subunit alpha
Type:Protein
Mol. Mass.:208010.01
Organism:Homo sapiens (Human)
Description:P35499
Residue:1836
BDBM50291990
NameBDBM50291990
Synonyms:(R)-2-Amino-N-(2,6-dimethyl-phenyl)-propionamide(tocainide) 2-Amino-N-(2,6-dimethyl-phenyl)-propionamide TOCAINIDE W-36095
TypeSmall organic molecule
Emp. Form.C11H16N2O
Mol. Mass.192.2575
SMILESC[C@@H](N)C(=O)Nc1c(C)cccc1C