Reaction Details
TargetSodium channel protein type 4 subunit alpha
LigandBDBM50413869
Substrate/Competitorn/a
Meas. Tech.ChEMBL_521570 (CHEMBL1004181)
EC50 2691.53±n/a nM
Citation Carrieri, AMuraglia, MCorbo, FPacifico, C 2D- and 3D-QSAR of tocainide and mexiletine analogues acting as Na(v)1.4 channel blockers. Eur J Med Chem44:1477-85 (2009) 
 
Sodium channel protein type 4 subunit alpha
Name:Sodium channel protein type 4 subunit alpha
Type:Protein
Mol. Mass.:208010.01
Organism:Homo sapiens (Human)
Description:P35499
Residue:1836
BDBM50413869
NameBDBM50413869
Synonyms:CHEMBL448542
TypeSmall organic molecule
Emp. Form.C12H19NS
Mol. Mass.209.351
SMILESC[C@H](CN)CSc1c(C)cccc1C