Reaction Details
TargetCytochrome P450 2A5
LigandBDBM50159260
Substrate/Competitorn/a
Meas. Tech.ChEMBL_572014 (CHEMBL1023676)
IC50 13996±n/a nM
Citation Roy, KRoy, PP Exploring QSAR and QAAR for inhibitors of cytochrome P450 2A6 and 2A5 enzymes using GFA and G/PLS techniques. Eur J Med Chem44:1941-51 (2009) 
 
Cytochrome P450 2A5
Name:Cytochrome P450 2A5
Type:PROTEIN
Mol. Mass.:56752.73
Organism:Mus musculus
Description:ChEMBL_572014
Residue:494
BDBM50159260
NameBDBM50159260
Synonyms:1-Chloro-naphthalene CHEMBL195338
TypeSmall organic molecule
Emp. Form.C10H7Cl
Mol. Mass.162.616
SMILESClc1cccc2ccccc12