Reaction Details
TargetCytochrome P450 2A5
LigandBDBM50159272
Substrate/Competitorn/a
Meas. Tech.ChEMBL_572014 (CHEMBL1023676)
IC50 2500±n/a nM
Citation Roy, KRoy, PP Exploring QSAR and QAAR for inhibitors of cytochrome P450 2A6 and 2A5 enzymes using GFA and G/PLS techniques. Eur J Med Chem44:1941-51 (2009) 
 
Cytochrome P450 2A5
Name:Cytochrome P450 2A5
Type:PROTEIN
Mol. Mass.:56752.73
Organism:Mus musculus
Description:ChEMBL_572014
Residue:494
BDBM50159272
NameBDBM50159272
Synonyms:2-Bromo-naphthalene CHEMBL192643
TypeSmall organic molecule
Emp. Form.C10H7Br
Mol. Mass.207.067
SMILESBrc1ccc2ccccc2c1