Reaction Details
TargetCannabinoid receptor 1
LigandBDBM50265756
Substrate/Competitorn/a
Meas. Tech.ChEMBL_570538 (CHEMBL1026910)
Ki 1380.38±n/a nM
Citation De Freitas, GBda Silva, LLRomeiro, NCFraga, CA Development of CoMFA and CoMSIA models of affinity and selectivity for indole ligands of cannabinoid CB1 and CB2 receptors. Eur J Med Chem44:2482-96 (2009) 
 
Cannabinoid receptor 1
Name:Cannabinoid receptor 1
Type:G Protein-Coupled Receptor (GPCR)
Mol. Mass.:52856.55
Organism:Rattus norvegicus (rat)
Description:P20272
Residue:473
BDBM50265756
NameBDBM50265756
Synonyms:(2-methoxynaphthalen-1-yl)(2-methyl-1-pentyl-1H-indol-3-yl)methanone JWH-268
TypeSmall organic molecule
Emp. Form.C26H27NO2
Mol. Mass.385.4981
SMILESCCCCCn1c(C)c(C(=O)c2c(OC)ccc3ccccc23)c2ccccc12