Reaction Details
TargetSerine/threonine-protein kinase Chk1
LigandBDBM50414075
Substrate/Competitorn/a
Meas. Tech.ChEMBL_570759 (CHEMBL1026934)
Ki 10±n/a nM
Citation Brown, SPMuchmore, SW Large-scale application of high-throughput molecular mechanics with Poisson-Boltzmann surface area for routine physics-based scoring of protein-ligand complexes. J Med Chem52:3159-65 (2009) 
 
Serine/threonine-protein kinase Chk1
Name:Serine/threonine-protein kinase Chk1
Type:Enzyme Catalytic Domain
Mol. Mass.:54443.02
Organism:Homo sapiens (Human)
Description:gi_166295192
Residue:476
BDBM50414075
NameBDBM50414075
Synonyms:CHEMBL563331
TypeSmall organic molecule
Emp. Form.C21H18N4O2
Mol. Mass.358.3932
SMILESN#Cc1ccc(cn1)-c1n[nH]c-2c1Cc1cc(OC3CCOCC3)ccc-21