Reaction Details
TargetSerine/threonine-protein kinase Chk1
LigandBDBM50414150
Substrate/Competitorn/a
Meas. Tech.ChEMBL_570759 (CHEMBL1026934)
Ki 6.3±n/a nM
Citation Brown, SPMuchmore, SW Large-scale application of high-throughput molecular mechanics with Poisson-Boltzmann surface area for routine physics-based scoring of protein-ligand complexes. J Med Chem52:3159-65 (2009) 
 
Serine/threonine-protein kinase Chk1
Name:Serine/threonine-protein kinase Chk1
Type:Enzyme Catalytic Domain
Mol. Mass.:54443.02
Organism:Homo sapiens (Human)
Description:gi_166295192
Residue:476
BDBM50414150
NameBDBM50414150
Synonyms:CHEMBL559498
TypeSmall organic molecule
Emp. Form.C27H23N3O4
Mol. Mass.453.4892
SMILESCOc1cccc(c1)-c1ccc2c(Nc3cc(OCc4ccncc4)c(OC)cc3NC2=O)c1