Reaction Details
TargetSerine/threonine-protein kinase Chk1
LigandBDBM91966
Substrate/Competitorn/a
Meas. Tech.ChEMBL_570759 (CHEMBL1026934)
Ki 7.9±n/a nM
Citation Brown, SPMuchmore, SW Large-scale application of high-throughput molecular mechanics with Poisson-Boltzmann surface area for routine physics-based scoring of protein-ligand complexes. J Med Chem52:3159-65 (2009) 
 
Serine/threonine-protein kinase Chk1
Name:Serine/threonine-protein kinase Chk1
Type:Enzyme Catalytic Domain
Mol. Mass.:54443.02
Organism:Homo sapiens (Human)
Description:gi_166295192
Residue:476
BDBM91966
NameBDBM91966
Synonyms:Chk1_97
Typen/a
Emp. Form.C23H21N3O4
Mol. Mass.403.4305
SMILESCOC(=O)Cc1ccc2Nc3cc(ccc3C(=O)Nc2c1)-c1cc(OC)ncc1C