Reaction Details
TargetSerine/threonine-protein kinase Chk1
LigandBDBM91948
Substrate/Competitorn/a
Meas. Tech.ChEMBL_570759 (CHEMBL1026934)
Ki 6.3±n/a nM
Citation Brown, SPMuchmore, SW Large-scale application of high-throughput molecular mechanics with Poisson-Boltzmann surface area for routine physics-based scoring of protein-ligand complexes. J Med Chem52:3159-65 (2009) 
 
Serine/threonine-protein kinase Chk1
Name:Serine/threonine-protein kinase Chk1
Type:Enzyme Catalytic Domain
Mol. Mass.:54443.02
Organism:Homo sapiens (Human)
Description:gi_166295192
Residue:476
BDBM91948
NameBDBM91948
Synonyms:Chk1_80
Typen/a
Emp. Form.C24H22N4O5
Mol. Mass.446.4553
SMILESCOc1cc(ccc1[N+]([O-])=O)-c1ccc2c(Nc3ccc(CC(=O)N(C)C)cc3NC2=O)c1