Reaction Details
TargetSerine/threonine-protein kinase Chk1
LigandBDBM91886
Substrate/Competitorn/a
Meas. Tech.ChEMBL_570759 (CHEMBL1026934)
Ki 200±n/a nM
Citation Brown, SPMuchmore, SW Large-scale application of high-throughput molecular mechanics with Poisson-Boltzmann surface area for routine physics-based scoring of protein-ligand complexes. J Med Chem52:3159-65 (2009) 
 
Serine/threonine-protein kinase Chk1
Name:Serine/threonine-protein kinase Chk1
Type:Enzyme Catalytic Domain
Mol. Mass.:54443.02
Organism:Homo sapiens (Human)
Description:gi_166295192
Residue:476
BDBM91886
NameBDBM91886
Synonyms:Chk1_21
Typen/a
Emp. Form.C20H16N2O4
Mol. Mass.348.352
SMILESCOc1cc(ccc1O)-c1ccc2c(Nc3c(O)cccc3NC2=O)c1