Reaction Details
TargetTyrosine-protein phosphatase non-receptor type 1
LigandBDBM13976
Substrate/Competitorn/a
Meas. Tech.ChEMBL_570758 (CHEMBL1026933)
Ki 13±n/a nM
Citation Brown, SPMuchmore, SW Large-scale application of high-throughput molecular mechanics with Poisson-Boltzmann surface area for routine physics-based scoring of protein-ligand complexes. J Med Chem52:3159-65 (2009) 
 
Tyrosine-protein phosphatase non-receptor type 1
Name:Tyrosine-protein phosphatase non-receptor type 1
Type:Protein phosphatase
Mol. Mass.:49963.76
Organism:Homo sapiens (Human)
Description:Human recombinant GST-fusion PTP1B (1-435).
Residue:435
BDBM13976
NameBDBM13976
Synonyms:Aminobenzoic acid analog 5 | CHEMBL116605
TypeSmall organic molecule
Emp. Form.C34H37N3O11
Mol. Mass.663.6711
SMILESCCc1cc(CC(NC(C)=O)C(=O)NCCCCOc2cccc(O)c2C(=O)OC)ccc1N(C(=O)C(O)=O)c1ccccc1C(O)=O