Reaction Details
TargetUrokinase-type plasminogen activator
LigandBDBM50147086
Substrate/Competitorn/a
Meas. Tech.ChEMBL_570757 (CHEMBL1026932)
Ki 32±n/a nM
Citation Brown, SPMuchmore, SW Large-scale application of high-throughput molecular mechanics with Poisson-Boltzmann surface area for routine physics-based scoring of protein-ligand complexes. J Med Chem52:3159-65 (2009) 
 
Urokinase-type plasminogen activator
Name:Urokinase-type plasminogen activator
Type:Enzyme
Mol. Mass.:48528.62
Organism:Homo sapiens (Human)
Description:P00749
Residue:431
BDBM50147086
NameBDBM50147086
Synonyms:8-(PYRIMIDIN-2-YLAMINO)NAPHTHALENE-2-CARBOXIMIDAMIDE | CHEMBL103043
TypeSmall organic molecule
Emp. Form.C15H13N5
Mol. Mass.263.2972
SMILESNC(=N)c1ccc2cccc(Nc3ncccn3)c2c1