Reaction Details
TargetAdenosine receptor A2b
LigandBDBM50414360
Substrate/Competitorn/a
Meas. Tech.ChEMBL_575168 (CHEMBL1023664)
Ki 15.49±n/a nM
Citation Nieto, MIBalo, MCBrea, JCaamaño, OCadavid, MIFernández, FMera, XGLópez, CRodríguez-Borges, JE Synthesis of novel 1-alkyl-8-substituted-3-(3-methoxypropyl) xanthines as putative A(2B) receptor antagonists. Bioorg Med Chem17:3426-32 (2009) 
 
Adenosine receptor A2b
Name:Adenosine receptor A2b
Type:G Protein-Coupled Receptor (GPCR)
Mol. Mass.:36341.22
Organism:Homo sapiens (Human)
Description:n/a
Residue:332
BDBM50414360
NameBDBM50414360
Synonyms:CHEMBL562427
TypeSmall organic molecule
Emp. Form.C25H27N5O6
Mol. Mass.493.5118
SMILESCCn1c(=O)n(CCCOC)c2nc([nH]c2c1=O)-c1ccc(OCC(=O)Nc2ccc(O)cc2)cc1