Reaction Details
TargetAlpha-1A adrenergic receptor
LigandBDBM86731
Substrate/Competitorn/a
Meas. Tech.ChEMBL_574168 (CHEMBL1060369)
Ki 0.537±n/a nM
Citation Giardinà, DMartarelli, DSagratini, GAngeli, PBallinari, DGulini, UMelchiorre, CPoggesi, EPompei, P Doxazosin-related alpha1-adrenoceptor antagonists with prostate antitumor activity. J Med Chem52:4951-4 (2009) 
 
Alpha-1A adrenergic receptor
Name:Alpha-1A adrenergic receptor
Type:Cell-surface receptors
Mol. Mass.:51511.67
Organism:Homo sapiens (Human)
Description:P35348
Residue:466
BDBM86731
NameBDBM86731
Synonyms:CAS_74191-85-8 UK 33,274
TypeSmall organic molecule
Emp. Form.C23H25N5O5
Mol. Mass.451.4751
SMILESCOc1cc2nc(nc(N)c2cc1OC)N1CCN(CC1)C(=O)C1COc2ccccc2O1