Reaction Details
TargetSodium-dependent serotonin transporter
LigandBDBM50414583
Substrate/Competitorn/a
Meas. Tech.ChEMBL_582670 (CHEMBL1051044)
Ki 1.26±n/a nM
Citation Lucas, MCCarter, DSCai, HYLee, EKSchoenfeld, RCSteiner, SVilla, MWeikert, RJIyer, PS Novel, achiral aminoheterocycles as selective monoamine reuptake inhibitors. Bioorg Med Chem Lett19:4630-3 (2009) 
 
Sodium-dependent serotonin transporter
Name:Sodium-dependent serotonin transporter
Type:Multi-pass membrane protein
Mol. Mass.:70322.51
Organism:Homo sapiens (Human)
Description:P31645
Residue:630
BDBM50414583
NameBDBM50414583
Synonyms:CHEMBL564094
TypeSmall organic molecule
Emp. Form.C20H22FN3
Mol. Mass.323.4072
SMILESFc1cccc(CN(C2CCNCC2)c2ccc3[nH]ccc3c2)c1