Reaction Details
TargetEcdysone receptor
LigandBDBM50414645
Substrate/Competitorn/a
Meas. Tech.ChEMBL_582869 (CHEMBL1051107)
IC50 61.66±n/a nM
Citation Harada, TNakagawa, YAkamatsu, MMiyagawa, H Evaluation of hydrogen bonds of ecdysteroids in the ligand-receptor interactions using a protein modeling system. Bioorg Med Chem17:5868-73 (2009) 
 
Ecdysone receptor
Name:Ecdysone receptor
Type:PROTEIN
Mol. Mass.:93857.12
Organism:Drosophila melanogaster
Description:ChEMBL_582869
Residue:878
BDBM50414645
NameBDBM50414645
Synonyms:CYASTERONE
TypeSmall organic molecule
Emp. Form.C29H44O8
Mol. Mass.520.6549
SMILESC[C@H]1OC(=O)[C@@H](C)[C@@H]1C[C@@H](O)[C@](C)(O)[C@H]1CC[C@@]2(O)C3=CC(=O)[C@@H]4C[C@@H](O)[C@@H](O)C[C@]4(C)[C@H]3CC[C@]12C