Reaction Details
TargetEcdysone receptor
LigandBDBM50414655
Substrate/Competitorn/a
Meas. Tech.ChEMBL_582869 (CHEMBL1051107)
IC50 9549.93±n/a nM
Citation Harada, TNakagawa, YAkamatsu, MMiyagawa, H Evaluation of hydrogen bonds of ecdysteroids in the ligand-receptor interactions using a protein modeling system. Bioorg Med Chem17:5868-73 (2009) 
 
Ecdysone receptor
Name:Ecdysone receptor
Type:PROTEIN
Mol. Mass.:93857.12
Organism:Drosophila melanogaster
Description:ChEMBL_582869
Residue:878
BDBM50414655
NameBDBM50414655
Synonyms:CHEMBL560796
TypeSmall organic molecule
Emp. Form.C27H46O4
Mol. Mass.434.6517
SMILESCC(C)CC[C@@H](O)[C@](C)(O)[C@H]1CC[C@H]2[C@@H]3CC(=O)[C@H]4C[C@@H](O)CC[C@]4(C)[C@H]3CC[C@]12C