Reaction Details
TargetEcdysone receptor
LigandBDBM50414658
Substrate/Competitorn/a
Meas. Tech.ChEMBL_582869 (CHEMBL1051107)
IC50 58.88±n/a nM
Citation Harada, TNakagawa, YAkamatsu, MMiyagawa, H Evaluation of hydrogen bonds of ecdysteroids in the ligand-receptor interactions using a protein modeling system. Bioorg Med Chem17:5868-73 (2009) 
 
Ecdysone receptor
Name:Ecdysone receptor
Type:PROTEIN
Mol. Mass.:93857.12
Organism:Drosophila melanogaster
Description:ChEMBL_582869
Residue:878
BDBM50414658
NameBDBM50414658
Synonyms:CHEMBL559048
TypeSmall organic molecule
Emp. Form.C27H46O5
Mol. Mass.450.6511
SMILESCC(C)CC[C@@H](O)[C@](C)(O)[C@H]1CC[C@H]2[C@@H]3CC(=O)[C@@H]4C[C@@H](O)[C@@H](O)C[C@]4(C)[C@H]3CC[C@]12C