Reaction Details
Target5-hydroxytryptamine receptor 4
LigandBDBM50388687
Substrate/Competitorn/a
Meas. Tech.ChEMBL_583010 (CHEMBL1051848)
Ki 12.59±n/a nM
Citation McKinnell, RMArmstrong, SRBeattie, DTChoi, SKFatheree, PRGendron, RAGoldblum, AHumphrey, PPLong, DDMarquess, DGShaw, JPSmith, JATurner, SDVickery, RG A multivalent approach to the design and discovery of orally efficacious 5-HT4 receptor agonists. J Med Chem52:5330-43 (2009) 
 
5-hydroxytryptamine receptor 4
Name:5-hydroxytryptamine receptor 4
Type:Enzyme
Mol. Mass.:43767.54
Organism:Homo sapiens (Human)
Description:Q13639
Residue:388
BDBM50388687
NameBDBM50388687
Synonyms:CHEMBL538635
TypeSmall organic molecule
Emp. Form.C28H41N5O5S
Mol. Mass.559.721
SMILESCC(C)n1c2ccccc2cc(C(=O)N[C@@H]2C[C@@H]3CC[C@H](C2)N3C[C@@H](O)CN2CCN(CC2)S(C)(=O)=O)c1=O