Reaction Details
Target5-hydroxytryptamine receptor 4
LigandBDBM50414734
Substrate/Competitorn/a
Meas. Tech.ChEMBL_583010 (CHEMBL1051848)
Ki 2.51±n/a nM
Citation McKinnell, RMArmstrong, SRBeattie, DTChoi, SKFatheree, PRGendron, RAGoldblum, AHumphrey, PPLong, DDMarquess, DGShaw, JPSmith, JATurner, SDVickery, RG A multivalent approach to the design and discovery of orally efficacious 5-HT4 receptor agonists. J Med Chem52:5330-43 (2009) 
 
5-hydroxytryptamine receptor 4
Name:5-hydroxytryptamine receptor 4
Type:Enzyme
Mol. Mass.:43767.54
Organism:Homo sapiens (Human)
Description:Q13639
Residue:388
BDBM50414734
NameBDBM50414734
Synonyms:CHEMBL551013
TypeSmall organic molecule
Emp. Form.C32H48N4O2
Mol. Mass.520.7491
SMILES[H][C@]12CC[C@]([H])(C[C@@H](C1)NC(=O)c1cc3ccccc3n(C(C)C)c1=O)N2CCCCCCCN1CCCCC1