Reaction Details
TargetFatty-acid amide hydrolase 1
LigandBDBM50132713
Substrate/Competitorn/a
Meas. Tech.ChEMBL_592876 (CHEMBL1046621)
IC50 0.331±n/a nM
Citation Kapanda, CNMuccioli, GGLabar, GPoupaert, JHLambert, DM Bis(dialkylaminethiocarbonyl)disulfides as potent and selective monoglyceride lipase inhibitors. J Med Chem52:7310-4 (2009) 
 
Fatty-acid amide hydrolase 1
Name:Fatty-acid amide hydrolase 1
Type:Protein
Mol. Mass.:63071.19
Organism:Homo sapiens (Human)
Description:O00519
Residue:579
BDBM50132713
NameBDBM50132713
Synonyms:Arachidonic acid derivative Methyl arachidonoyl fluorophophonate methyl (5Z,8Z,11Z,14Z)-icosa-5,8,11,14-tetraenylphosphonofluoridate methyl(5Z,8Z,11Z,14Z)-icosa-5,8,11,14-tetraenylphosphonofluoridate | methylarachidonyl fluorophosphonate
TypeSmall organic molecule
Emp. Form.C21H36FO2P
Mol. Mass.370.4815
SMILESCCCCC\C=C/C\C=C/C\C=C/C\C=C/CCCCP(F)(=O)OC