Reaction Details
TargetMonoglyceride lipase
LigandBDBM26736
Substrate/Competitorn/a
Meas. Tech.ChEMBL_592875 (CHEMBL1046620)
IC50 54.95±n/a nM
Citation Kapanda, CNMuccioli, GGLabar, GPoupaert, JHLambert, DM Bis(dialkylaminethiocarbonyl)disulfides as potent and selective monoglyceride lipase inhibitors. J Med Chem52:7310-4 (2009) 
 
Monoglyceride lipase
Name:Monoglyceride lipase
Type:Hydrolase
Mol. Mass.:33264.56
Organism:Homo sapiens (Human)
Description:Human recombinant MGL (Cayman Chemical, cat# 10008354).
Residue:303
BDBM26736
NameBDBM26736
Synonyms:CHEMBL509860 N,N-dimethyl-5-[(4-phenylphenyl)methyl]-1H-1,2,3,4-tetrazole-1-carboxamide
TypeSmall organic molecule
Emp. Form.C17H17N5O
Mol. Mass.307.3498
SMILESCN(C)C(=O)n1nnnc1Cc1ccc(cc1)-c1ccccc1