Reaction Details
TargetMonoglyceride lipase
LigandBDBM50361476
Substrate/Competitorn/a
Meas. Tech.ChEMBL_592875 (CHEMBL1046620)
IC50 912.01±n/a nM
Citation Kapanda, CNMuccioli, GGLabar, GPoupaert, JHLambert, DM Bis(dialkylaminethiocarbonyl)disulfides as potent and selective monoglyceride lipase inhibitors. J Med Chem52:7310-4 (2009) 
 
Monoglyceride lipase
Name:Monoglyceride lipase
Type:Hydrolase
Mol. Mass.:33264.56
Organism:Homo sapiens (Human)
Description:Human recombinant MGL (Cayman Chemical, cat# 10008354).
Residue:303
BDBM50361476
NameBDBM50361476
Synonyms:CHEMBL583959
TypeSmall organic molecule
Emp. Form.C10H16N2S4
Mol. Mass.292.507
SMILESS=C(SSC(=S)N1CCCC1)N1CCCC1