Reaction Details
TargetPotassium voltage-gated channel subfamily H member 2
LigandBDBM50414979
Substrate/Competitorn/a
Meas. Tech.ChEMBL_594036 (CHEMBL1045843)
IC50 7079.46±n/a nM
Citation Shamovsky, Ide Graaf, CAlderin, LBengtsson, MBladh, HBörjesson, LConnolly, SDyke, HJvan den Heuvel, MJohansson, HJosefsson, BGKristoffersson, ALinnanen, TLisius, AMännikkö, RNordén, BPrice, SRipa, LRognan, DRosendahl, ASkrinjar, MUrbahns, K Increasing selectivity of CC chemokine receptor 8 antagonists by engineering nondesolvation related interactions with the intended and off-target binding sites. J Med Chem52:7706-23 (2009) 
 
Potassium voltage-gated channel subfamily H member 2
Name:Potassium voltage-gated channel subfamily H member 2
Type:Multi-pass membrane protein
Mol. Mass.:126672.65
Organism:Homo sapiens (Human)
Description:Q12809
Residue:1159
BDBM50414979
NameBDBM50414979
Synonyms:CHEMBL583621
TypeSmall organic molecule
Emp. Form.C26H33N3O2
Mol. Mass.419.5591
SMILESCC1(C)Cc2c(O1)cccc2CN1CCC2(CC1)CCN(CC2)C(=O)c1ccncc1