Reaction Details
TargetSigma non-opioid intracellular receptor 1
LigandBDBM50064171
Substrate/Competitorn/a
Meas. Tech.ChEMBL_595183 (CHEMBL1040025)
Ki 0.617±n/a nM
Citation Piergentili, AAmantini, CDel Bello, FGiannella, MMattioli, LPalmery, MPerfumi, MPigini, MSantoni, GTucci, PZotti, MQuaglia, W Novel highly potent and selective sigma 1 receptor antagonists related to spipethiane. J Med Chem53:1261-9 (2010) 
 
Sigma non-opioid intracellular receptor 1
Name:Sigma non-opioid intracellular receptor 1
Type:Enzyme Catalytic Domain
Mol. Mass.:25124.85
Organism:Homo sapiens (Human)
Description:Q99720
Residue:223
BDBM50064171
NameBDBM50064171
Synonyms:1'-benzylspiro[3,4-dihydro-2H-chromene-2,4'-(hexahydropyridine)] CHEMBL38634
TypeSmall organic molecule
Emp. Form.C20H23NO
Mol. Mass.293.4027
SMILESC(N1CCC2(CC1)CCc1ccccc1O2)c1ccccc1