Reaction Details
TargetAdenosine receptor A2b
LigandBDBM50415168
Substrate/Competitorn/a
Meas. Tech.ChEMBL_601035 (CHEMBL1069172)
Ki 12.88±n/a nM
Citation Balo, MCBrea, JCaamaño, OFernández, FGarcía-Mera, XLópez, CLoza, MINieto, MIRodríguez-Borges, JE Synthesis and pharmacological evaluation of novel 1- and 8-substituted-3-furfuryl xanthines as adenosine receptor antagonists. Bioorg Med Chem17:6755-60 (2009) 
 
Adenosine receptor A2b
Name:Adenosine receptor A2b
Type:G Protein-Coupled Receptor (GPCR)
Mol. Mass.:36341.22
Organism:Homo sapiens (Human)
Description:n/a
Residue:332
BDBM50415168
NameBDBM50415168
Synonyms:CHEMBL593217
TypeSmall organic molecule
Emp. Form.C20H20N4O3
Mol. Mass.364.3978
SMILESCCn1c(=O)n(Cc2ccco2)c2nc(Cc3ccccc3)n(C)c2c1=O