Reaction Details
TargetAdenosine receptor A2b
LigandBDBM50415169
Substrate/Competitorn/a
Meas. Tech.ChEMBL_601035 (CHEMBL1069172)
Ki 13.8±n/a nM
Citation Balo, MCBrea, JCaamaño, OFernández, FGarcía-Mera, XLópez, CLoza, MINieto, MIRodríguez-Borges, JE Synthesis and pharmacological evaluation of novel 1- and 8-substituted-3-furfuryl xanthines as adenosine receptor antagonists. Bioorg Med Chem17:6755-60 (2009) 
 
Adenosine receptor A2b
Name:Adenosine receptor A2b
Type:G Protein-Coupled Receptor (GPCR)
Mol. Mass.:36341.22
Organism:Homo sapiens (Human)
Description:n/a
Residue:332
BDBM50415169
NameBDBM50415169
Synonyms:CHEMBL594271
TypeSmall organic molecule
Emp. Form.C18H18N4O4
Mol. Mass.354.3599
SMILESCCn1c(=O)n(Cc2ccco2)c2nc(Cc3ccco3)n(C)c2c1=O