Reaction Details
TargetAdenosine receptor A1
LigandBDBM50415168
Substrate/Competitorn/a
Meas. Tech.ChEMBL_601032 (CHEMBL1069169)
Ki 28.84±n/a nM
Citation Balo, MCBrea, JCaamaño, OFernández, FGarcía-Mera, XLópez, CLoza, MINieto, MIRodríguez-Borges, JE Synthesis and pharmacological evaluation of novel 1- and 8-substituted-3-furfuryl xanthines as adenosine receptor antagonists. Bioorg Med Chem17:6755-60 (2009) 
 
Adenosine receptor A1
Name:Adenosine receptor A1
Type:Protein
Mol. Mass.:36704.13
Organism:Rattus norvegicus (rat)
Description:n/a
Residue:326
BDBM50415168
NameBDBM50415168
Synonyms:CHEMBL593217
TypeSmall organic molecule
Emp. Form.C20H20N4O3
Mol. Mass.364.3978
SMILESCCn1c(=O)n(Cc2ccco2)c2nc(Cc3ccccc3)n(C)c2c1=O