Reaction Details
TargetAdenosine receptor A2b
LigandBDBM50415455
Substrate/Competitorn/a
Meas. Tech.ChEMBL_611640 (CHEMBL1071010)
Ki 35.48±n/a nM
Citation Rodríguez-Borges, JEGarcía-Mera, XBalo, MCBrea, JCaamaño, OFernández, FLópez, CLoza, MINieto, MI Synthesis and pharmacological evaluation of novel 1,3,8- and 1,3,7,8-substituted xanthines as adenosine receptor antagonists. Bioorg Med Chem18:2001-9 (2010) 
 
Adenosine receptor A2b
Name:Adenosine receptor A2b
Type:G Protein-Coupled Receptor (GPCR)
Mol. Mass.:36341.22
Organism:Homo sapiens (Human)
Description:n/a
Residue:332
BDBM50415455
NameBDBM50415455
Synonyms:CHEMBL603878
TypeSmall organic molecule
Emp. Form.C18H18N4O2S2
Mol. Mass.386.491
SMILESCCn1c(=O)n(Cc2cccs2)c2nc(Cc3cccs3)n(C)c2c1=O