Reaction Details
TargetMitogen-activated protein kinase 14
LigandBDBM50415604
Substrate/Competitorn/a
Meas. Tech.ChEMBL_621742 (CHEMBL1108474)
IC50>15848.93±n/a nM
Citation Christopher, JAAtkinson, FLBax, BDBrown, MJChampigny, ACChuang, TTJones, EJMosley, JEMusgrave, JR 1-Aryl-3,4-dihydroisoquinoline inhibitors of JNK3. Bioorg Med Chem Lett19:2230-4 (2009) 
 
Mitogen-activated protein kinase 14
Name:Mitogen-activated protein kinase 14
Type:Serine/threonine-protein kinase
Mol. Mass.:41286.76
Organism:Homo sapiens (Human)
Description:Q16539
Residue:360
BDBM50415604
NameBDBM50415604
Synonyms:CHEMBL1077116
TypeSmall organic molecule
Emp. Form.C16H13Cl2NO
Mol. Mass.306.187
SMILESCOc1cc2C(=NCCc2cc1Cl)c1cccc(Cl)c1