Reaction Details
TargetMitogen-activated protein kinase 10
LigandBDBM50415617
Substrate/Competitorn/a
Meas. Tech.ChEMBL_621741 (CHEMBL1108473)
IC50 15848.93±n/a nM
Citation Christopher, JAAtkinson, FLBax, BDBrown, MJChampigny, ACChuang, TTJones, EJMosley, JEMusgrave, JR 1-Aryl-3,4-dihydroisoquinoline inhibitors of JNK3. Bioorg Med Chem Lett19:2230-4 (2009) 
 
Mitogen-activated protein kinase 10
Name:Mitogen-activated protein kinase 10
Type:Enzyme
Mol. Mass.:52586.89
Organism:Homo sapiens (Human)
Description:n/a
Residue:464
BDBM50415617
NameBDBM50415617
Synonyms:CHEMBL1087544
TypeSmall organic molecule
Emp. Form.C16H12Cl3NO
Mol. Mass.340.632
SMILESCOc1cc2C(=NCCc2cc1Cl)c1ccc(Cl)c(Cl)c1