Reaction Details
TargetMitogen-activated protein kinase 14
LigandBDBM50415617
Substrate/Competitorn/a
Meas. Tech.ChEMBL_621742 (CHEMBL1108474)
IC50>15848.93±n/a nM
Citation Christopher, JAAtkinson, FLBax, BDBrown, MJChampigny, ACChuang, TTJones, EJMosley, JEMusgrave, JR 1-Aryl-3,4-dihydroisoquinoline inhibitors of JNK3. Bioorg Med Chem Lett19:2230-4 (2009) 
 
Mitogen-activated protein kinase 14
Name:Mitogen-activated protein kinase 14
Type:Serine/threonine-protein kinase
Mol. Mass.:41286.76
Organism:Homo sapiens (Human)
Description:Q16539
Residue:360
BDBM50415617
NameBDBM50415617
Synonyms:CHEMBL1087544
TypeSmall organic molecule
Emp. Form.C16H12Cl3NO
Mol. Mass.340.632
SMILESCOc1cc2C(=NCCc2cc1Cl)c1ccc(Cl)c(Cl)c1