Reaction Details
TargetMitogen-activated protein kinase 10
LigandBDBM50172920
Substrate/Competitorn/a
Meas. Tech.ChEMBL_621739 (CHEMBL1108471)
IC50 1.26±n/a nM
Citation Christopher, JAAtkinson, FLBax, BDBrown, MJChampigny, ACChuang, TTJones, EJMosley, JEMusgrave, JR 1-Aryl-3,4-dihydroisoquinoline inhibitors of JNK3. Bioorg Med Chem Lett19:2230-4 (2009) 
 
Mitogen-activated protein kinase 10
Name:Mitogen-activated protein kinase 10
Type:Enzyme
Mol. Mass.:52586.89
Organism:Homo sapiens (Human)
Description:n/a
Residue:464
BDBM50172920
NameBDBM50172920
Synonyms:3-(6-(2-chlorophenylamino)-1H-indazol-3-yl)-N-(piperidin-4-yl)benzamide CHEMBL194806
TypeSmall organic molecule
Emp. Form.C25H24ClN5O
Mol. Mass.445.944
SMILESClc1ccccc1Nc1ccc2c(n[nH]c2c1)-c1cccc(c1)C(=O)NC1CCNCC1