Reaction Details
TargetEpidermal growth factor receptor
LigandBDBM50415620
Substrate/Competitorn/a
Meas. Tech.ChEMBL_621754 (CHEMBL1108486)
IC50>10000±n/a nM
Citation Christopher, JAAtkinson, FLBax, BDBrown, MJChampigny, ACChuang, TTJones, EJMosley, JEMusgrave, JR 1-Aryl-3,4-dihydroisoquinoline inhibitors of JNK3. Bioorg Med Chem Lett19:2230-4 (2009) 
 
Epidermal growth factor receptor
Name:Epidermal growth factor receptor
Type:Receptor Kinase Domain
Mol. Mass.:134279.59
Organism:Homo sapiens (Human)
Description:P00533
Residue:1210
BDBM50415620
NameBDBM50415620
Synonyms:CHEMBL1088633
TypeSmall organic molecule
Emp. Form.C16H13Cl2NO
Mol. Mass.306.187
SMILESCOc1cc2CCN=C(c3cccc(Cl)c3)c2cc1Cl