Reaction Details
TargetCyclin-dependent kinase 2
LigandBDBM50415616
Substrate/Competitorn/a
Meas. Tech.ChEMBL_621753 (CHEMBL1108485)
IC50>10000±n/a nM
Citation Christopher, JAAtkinson, FLBax, BDBrown, MJChampigny, ACChuang, TTJones, EJMosley, JEMusgrave, JR 1-Aryl-3,4-dihydroisoquinoline inhibitors of JNK3. Bioorg Med Chem Lett19:2230-4 (2009) 
 
Cyclin-dependent kinase 2
Name:Cyclin-dependent kinase 2
Type:Enzyme Subunit
Mol. Mass.:33938.17
Organism:Homo sapiens (Human)
Description:P24941
Residue:298
BDBM50415616
NameBDBM50415616
Synonyms:CHEMBL1087421
TypeSmall organic molecule
Emp. Form.C16H12Cl3NO
Mol. Mass.340.632
SMILESCOc1cc2CCN=C(c3ccc(Cl)c(Cl)c3)c2cc1Cl