Reaction Details
TargetHistamine H1 receptor
LigandBDBM22880
Substrate/Competitorn/a
Meas. Tech.ChEMBL_621958 (CHEMBL1104100)
EC50 15848.93±n/a nM
Citation Igel, PGeyer, RStrasser, ADove, SSeifert, RBuschauer, A Synthesis and structure-activity relationships of cyanoguanidine-type and structurally related histamine H4 receptor agonists. J Med Chem52:6297-313 (2009) 
 
Histamine H1 receptor
Name:Histamine H1 receptor
Type:G Protein-Coupled Receptor (GPCR)
Mol. Mass.:55808.72
Organism:Homo sapiens (Human)
Description:Cell pellets from SK-N-MC cells transfected with human H1 receptor were used in binding assay.
Residue:487
BDBM22880
NameBDBM22880
Synonyms:2-(5-methyl-1H-imidazol-4-yl)ethan-1-amine Methylhistamine-4
TypeSmall organic molecule
Emp. Form.C6H11N3
Mol. Mass.125.1716
SMILESCc1nc[nH]c1CCN