Reaction Details
TargetCarbonic anhydrase 2
LigandBDBM10858
Substrate/Competitorn/a
Meas. Tech.ChEMBL_632192 (CHEMBL1106525)
Ki 3120000±n/a nM
Citation Sethi, KKVerma, SMPrasanthi, NSahoo, SKParhi, RNSuresh, P 3D-QSAR study of benzene sulfonamide analogs as carbonic anhydrase II inhibitors. Bioorg Med Chem Lett20:3089-93 (2010) 
 
Carbonic anhydrase 2
Name:Carbonic anhydrase 2
Type:Enzyme
Mol. Mass.:29250.71
Organism:Homo sapiens (Human)
Description:P00918
Residue:260
BDBM10858
NameBDBM10858
Synonyms:4-hydrazinylbenzene-1-sulfonamide aromatic/heteroaromatic sulfonamide 3 | hydrazide deriv. 14
TypeSmall organic molecule
Emp. Form.C6H9N3O2S
Mol. Mass.187.22
SMILESNNc1ccc(cc1)S(N)(=O)=O