Reaction Details
TargetP2X purinoceptor 7
LigandBDBM50415891
Substrate/Competitorn/a
Meas. Tech.ChEMBL_632126 (CHEMBL1103860)
IC50 63.1±n/a nM
Citation Chambers, LJStevens, AJMoses, APMichel, ADWalter, DSDavies, DJLivermore, DGFonfria, EDemont, EHVimal, MTheobald, PJBeswick, PJGleave, RJRoman, SASenger, S Synthesis and structure-activity relationships of a series of (1H-pyrazol-4-yl)acetamide antagonists of the P2X7 receptor. Bioorg Med Chem Lett20:3161-4 (2010) 
 
P2X purinoceptor 7
Name:P2X purinoceptor 7
Type:Protein
Mol. Mass.:68602.85
Organism:Homo sapiens (Human)
Description:Q99572
Residue:595
BDBM50415891
NameBDBM50415891
Synonyms:CHEMBL1094744
TypeSmall organic molecule
Emp. Form.C20H18Cl2FN3O
Mol. Mass.406.281
SMILESCc1nn(c(C)c1CC(=O)NCc1ccc(F)cc1Cl)-c1ccc(Cl)cc1