Reaction Details
TargetP2X purinoceptor 7
LigandBDBM50415908
Substrate/Competitorn/a
Meas. Tech.ChEMBL_632126 (CHEMBL1103860)
IC50 25.12±n/a nM
Citation Chambers, LJStevens, AJMoses, APMichel, ADWalter, DSDavies, DJLivermore, DGFonfria, EDemont, EHVimal, MTheobald, PJBeswick, PJGleave, RJRoman, SASenger, S Synthesis and structure-activity relationships of a series of (1H-pyrazol-4-yl)acetamide antagonists of the P2X7 receptor. Bioorg Med Chem Lett20:3161-4 (2010) 
 
P2X purinoceptor 7
Name:P2X purinoceptor 7
Type:Protein
Mol. Mass.:68602.85
Organism:Homo sapiens (Human)
Description:Q99572
Residue:595
BDBM50415908
NameBDBM50415908
Synonyms:CHEMBL1094641
TypeSmall organic molecule
Emp. Form.C20H19Cl2N3O
Mol. Mass.388.29
SMILESCc1nn(c(C)c1CC(=O)NCc1cccc(Cl)c1Cl)-c1ccccc1