Reaction Details
Target5-hydroxytryptamine receptor 6
LigandBDBM50415973
Substrate/Competitorn/a
Meas. Tech.ChEMBL_635521 (CHEMBL1118104)
Ki 0.631±n/a nM
Citation Harris, RNStabler, RSRepke, DBKress, JMWalker, KAMartin, RSBrothers, JMIlnicka, MLee, SWMirzadegan, T Highly potent, non-basic 5-HT6 ligands. Site mutagenesis evidence for a second binding mode at 5-HT6 for antagonism. Bioorg Med Chem Lett20:3436-40 (2010) 
 
5-hydroxytryptamine receptor 6
Name:5-hydroxytryptamine receptor 6
Type:G Protein-Coupled Receptor (GPCR)
Mol. Mass.:46968.43
Organism:Homo sapiens (Human)
Description:P50406
Residue:440
BDBM50415973
NameBDBM50415973
Synonyms:CHEMBL1086080
TypeSmall organic molecule
Emp. Form.C19H22N2O2S
Mol. Mass.342.455
SMILESCC(N)=NCC1CCCc2cc(ccc12)S(=O)(=O)c1ccccc1