Reaction Details
Target5-hydroxytryptamine receptor 6
LigandBDBM50415977
Substrate/Competitorn/a
Meas. Tech.ChEMBL_635521 (CHEMBL1118104)
Ki 0.631±n/a nM
Citation Harris, RNStabler, RSRepke, DBKress, JMWalker, KAMartin, RSBrothers, JMIlnicka, MLee, SWMirzadegan, T Highly potent, non-basic 5-HT6 ligands. Site mutagenesis evidence for a second binding mode at 5-HT6 for antagonism. Bioorg Med Chem Lett20:3436-40 (2010) 
 
5-hydroxytryptamine receptor 6
Name:5-hydroxytryptamine receptor 6
Type:G Protein-Coupled Receptor (GPCR)
Mol. Mass.:46968.43
Organism:Homo sapiens (Human)
Description:P50406
Residue:440
BDBM50415977
NameBDBM50415977
Synonyms:CHEMBL1085113
TypeSmall organic molecule
Emp. Form.C18H20N2O3S
Mol. Mass.344.428
SMILESNC(=O)NCC1CCCc2cc(ccc12)S(=O)(=O)c1ccccc1