Reaction Details
Target5-hydroxytryptamine receptor 6
LigandBDBM50416026
Substrate/Competitorn/a
Meas. Tech.ChEMBL_635521 (CHEMBL1118104)
Ki 2±n/a nM
Citation Harris, RNStabler, RSRepke, DBKress, JMWalker, KAMartin, RSBrothers, JMIlnicka, MLee, SWMirzadegan, T Highly potent, non-basic 5-HT6 ligands. Site mutagenesis evidence for a second binding mode at 5-HT6 for antagonism. Bioorg Med Chem Lett20:3436-40 (2010) 
 
5-hydroxytryptamine receptor 6
Name:5-hydroxytryptamine receptor 6
Type:G Protein-Coupled Receptor (GPCR)
Mol. Mass.:46968.43
Organism:Homo sapiens (Human)
Description:P50406
Residue:440
BDBM50416026
NameBDBM50416026
Synonyms:CHEMBL1083173
TypeSmall organic molecule
Emp. Form.C19H23FN2O4S2
Mol. Mass.426.525
SMILESCN(C)S(=O)(=O)NC[C@@H]1CCCc2cc(ccc12)S(=O)(=O)c1cccc(F)c1