Reaction Details
TargetTyrosine-protein phosphatase non-receptor type 1
LigandBDBM50118744
Substrate/Competitorn/a
Meas. Tech.ChEMBL_634028 (CHEMBL1118001)
Ki 14125.38±n/a nM
Citation Cheng, YZhou, MTung, CHJi, MZhang, F Studies on two types of PTP1B inhibitors for the treatment of type 2 diabetes: Hologram QSAR for OBA and BBB analogues. Bioorg Med Chem Lett20:3329-37 (2010) 
 
Tyrosine-protein phosphatase non-receptor type 1
Name:Tyrosine-protein phosphatase non-receptor type 1
Type:Protein phosphatase
Mol. Mass.:49963.76
Organism:Homo sapiens (Human)
Description:Human recombinant GST-fusion PTP1B (1-435).
Residue:435
BDBM50118744
NameBDBM50118744
Synonyms:2-(Oxalyl-amino)-4,7-dihydro-5H-thieno[2,3-c]pyran-3-carboxylic acid CHEMBL138806
TypeSmall organic molecule
Emp. Form.C10H9NO6S
Mol. Mass.271.247
SMILESOC(=O)C(=O)Nc1sc2COCCc2c1C(O)=O