Reaction Details
TargetAdenosine receptor A2b
LigandBDBM50416333
Substrate/Competitorn/a
Meas. Tech.ChEMBL_640438 (CHEMBL1174864)
Ki 40.74±n/a nM
Citation Nieto, MIBalo, MCBrea, JCaamaño, OFernández, FGarcía-Mera, XLópez, CLoza, MIRodríguez-Borges, JEVidal, B Synthesis and pharmacological evaluation of novel substituted 9-deazaxanthines as A2B receptor antagonists. Eur J Med Chem45:2884-92 (2010) 
 
Adenosine receptor A2b
Name:Adenosine receptor A2b
Type:G Protein-Coupled Receptor (GPCR)
Mol. Mass.:36341.22
Organism:Homo sapiens (Human)
Description:n/a
Residue:332
BDBM50416333
NameBDBM50416333
Synonyms:CHEMBL1171379
TypeSmall organic molecule
Emp. Form.C24H20BrN5O5
Mol. Mass.538.35
SMILESCOc1cc(OCc2nc(no2)-c2ccc(Br)cc2)ccc1-c1cc2n(C)c(=O)n(C)c(=O)c2[nH]1