Reaction Details
TargetN-acylethanolamine-hydrolyzing acid amidase
LigandBDBM50416514
Substrate/Competitorn/a
Meas. Tech.ChEMBL_647126 (CHEMBL1217267)
IC50>10000000±n/a nM
Citation Solorzano, CAntonietti, FDuranti, ATontini, ARivara, SLodola, AVacondio, FTarzia, GPiomelli, DMor, M Synthesis and structure-activity relationships of N-(2-oxo-3-oxetanyl)amides as N-acylethanolamine-hydrolyzing acid amidase inhibitors. J Med Chem53:5770-81 (2010) 
 
N-acylethanolamine-hydrolyzing acid amidase
Name:N-acylethanolamine-hydrolyzing acid amidase
Type:Enzyme
Mol. Mass.:40306.53
Organism:Rattus norvegicus (Rat)
Description:Q5KTC7
Residue:362
BDBM50416514
NameBDBM50416514
Synonyms:CHEMBL1214328
TypeSmall organic molecule
Emp. Form.C13H15NO2
Mol. Mass.217.2637
SMILESO=C(CCc1ccccc1)NC1CCC1=O